vattenbalans
type: Concept
broader: balansräkning
in scheme: conceptscheme
preferred label: vesitase @fi
preferred label: water balance @en
scope note: Prosessia tai systeemiä koskeva tulevien, lähtevien ja varastoituvien vesimäärien esitys kirjanpidon kaltaisessa muodossa

balansräkning
type: Concept
narrower: vattenbalans
preferred label: balance sheets @en
preferred label: taseet @fi