sovitus (koettaminen)
type: Concept
source: Kielitoimiston sanakirja
comment: koettaa asustetta tms. sen (koon) sopivuuden, istuvuuden toteamiseksi
alternative label: sovitus
broader: kulutus ja käyttö
in scheme: conceptscheme
preferred label: fitting (clothes) @en
preferred label: provande @sv

kulutus ja käyttö
type: Concept
narrower: sovitus (koettaminen)
preferred label: konsumtion och användning @sv
preferred label: consumption and usage @en