företagsanalys
type: Concept
broader: forskningsverksamhet
in scheme: conceptscheme
preferred label: corporate analysis @en
preferred label: yritystutkimus @fi
scope note: Tarkoittaa yrityksen kannattavuuden, vakavaraisuuden ja menestymisedellytysten selvittämistä esim. rahoituspäätöstä tehtäessä
scope note: Avser utredning om ett företags lönsamhet, soliditet och förutsättningar för framgång, t.ex. vid beslut om finansiering.

forskningsverksamhet
type: Concept
narrower: företagsanalys
preferred label: research activity @en
preferred label: tutkimustoiminta @fi