uusinnat
type: Concept
source: Suomen kielen perussanakirja
comment: 1) uusiminen; 2) uusintaesitys, -kilpailu tms.; 3) uusimisen tulos, uusittu laitos
broader: järjestetty tapahtuma
in scheme: conceptscheme
preferred label: rebroadcasts @en
preferred label: repriser @sv
related: toistettavuus

toistettavuus
type: Concept
preferred label: repeterbarhet @sv
related: uusinnat

järjestetty tapahtuma
type: Concept
narrower: uusinnat
preferred label: arranged event @en
preferred label: ordnad händelse @sv