specialspråk
type: Concept
narrower: lättläst text
preferred label: special languages @en
preferred label: erikoiskielet @fi

lättläst text
type: Concept
source: Lähde: Kielikello 3/2002
broader: specialspråk
in scheme: conceptscheme
preferred label: simplified language @en
preferred label: selkokieli @fi
scope note: Selkokieli on sisällöltään, sanastoltaan ja rakenteeltaan yleiskieltä luettavammaksi ja ymmärrettäväksi mukautettua kieltä niitä ihmisiä varten, joilla on vaikeuksia lukemisessa tai/ja ymmärtämisessä