groteski (tyylit)
type: Concept
source: Kielitoimiston sanakirja
comment: eräs varsinaisesti renessanssin suosima koristekuviotyyli
alternative label: groteski
broader: tyylit (ilmiöt)
in scheme: conceptscheme
preferred label: grotesque (styles) @en
preferred label: grotesk @sv

tyylit (ilmiöt)
type: Concept
narrower: groteski (tyylit)
preferred label: stilar (fenomen) @sv
preferred label: styles @en