trädbestånd
type: Concept
narrower: underväxt (skog)
preferred label: tree stand @en
preferred label: puusto @fi

underväxt (skog)
type: Concept
source: Kielitoimiston sanakirja
comment: pääpuustoa nuorempi (ja matalampi) puusto
alternative label: underväxt
broader: trädbestånd
in scheme: conceptscheme
preferred label: alikasvos @fi
preferred label: understorey @en