sukupuolivähemmistöt
type: Concept
broader: vähemmistöt
in scheme: conceptscheme
preferred label: sexual minorities @en
preferred label: könsminoriteter @sv
related: Gay pride
scope note: Tarkoittaa henkilöitä, jotka eivät ole identiteetiltään tai ruumiilliselta olemukseltaan yksiselitteisesti miehiä tai naisia

Gay pride
type: Concept
related: sukupuolivähemmistöt

vähemmistöt
type: Concept
narrower: sukupuolivähemmistöt
preferred label: minoriteter @sv
preferred label: minorities @en