legality
type: Concept
preferred label: laglighet @sv
preferred label: laillisuus @fi
related: legitimacy

legitimacy
type: Concept
source: Kielitoimiston sanakirja
comment: laillisuus, lainmukaisuus, laillinen oikeutus; pol. järjestelmän ja oikeusjärjestelmän oikeutus ja hyväksyttävyys
broader: external properties
in scheme: conceptscheme
preferred label: legitimitet @sv
preferred label: legitimiteetti @fi
related: legality

external properties
type: Concept
narrower: legitimacy
preferred label: yttre egenskaper @sv
preferred label: ulkoiset ominaisuudet @fi