öppna universitetet
type: Concept
narrower: öppna högskolan
preferred label: open university @en
preferred label: avoin yliopisto @fi

öppna högskolan
type: Concept
broader: öppna universitetet
in scheme: conceptscheme
preferred label: avoin korkeakoulu @fi
preferred label: open academy @en
related: öppna yrkeshögskolan
scope note: Avoimesta yliopistosta 1990-luvun puoleenväliin käytetty nimitys
scope note: Till mitten av 1990 användes termen öppna högskolan

öppna yrkeshögskolan
type: Concept
preferred label: open polytechnic @en
preferred label: avoin ammattikorkeakoulu @fi
related: öppna högskolan