occupations
type: Concept
narrower: catechists
preferred label: yrken @sv
preferred label: ammatit @fi

catechists
type: Concept
source: Kielitoimiston sanakirja
comment: kristinopin alkeiden opettaja vars. lähetystyössä
broader: occupations
in scheme: conceptscheme
preferred label: kateketer @sv
preferred label: katekeetat @fi