Khitans
type: Concept
source: Lähde: Janhunen, Juha, Kiinan kadonneet kirjoitukset (artikkeli julkaisussa Kadonneet kulttuurit)
alternative label: Kidans
broader: role related to ancient peoples
in scheme: conceptscheme
preferred label: kitaner @sv
preferred label: kitaanit @fi
scope note: Kiinassa asunut ei-kiinalainen kansa, joka katosi 1100-1200-luvulla. Kiinaa v. 907-1125 hallinneen Liao-dynastian keisarit olivat kansallisuudeltaan kitaaneja

role related to ancient peoples
type: Concept
narrower: Khitans
preferred label: forntidsfolksroll @sv
preferred label: muinaiskansaan liittyvä rooli @fi