vuorokausirytmi (elintoimintojen)
type: Concept
source: Lähde: Lääketieteen termit
comment: Niiden elintoimintojen sisäsyntyinen rytmi, joiden toistuvan jakson pituus on suunnilleen 24 tuntia
alternative label: sirkadiaaninen rytmi
alternative label: sirkadiaanirytmi
alternative label: vuorokausirytmi
broader: biorytmit
in scheme: conceptscheme
preferred label: cirkadiansk rytm @sv
preferred label: diurnal rhythm @en
scope note: Sanalla on kaksi merkitystä. 1) Ulkoisten tekijöiden (aamuherätys, työaikataulu) ohjaama, tarkalleen vuorokauden pituisia jaksoja käsittävä rytmi. 2) Niiden elintoimintojen sisäsyntyinen rytmi, joiden toistuvan jakson pituus on suunnilleen 24 tuntia

biorytmit
type: Concept
narrower: vuorokausirytmi (elintoimintojen)
preferred label: biorhythms @en
preferred label: biorytmer @sv