vuorokausirytmi (toimintojen)
type: Concept
source: Lähde: Lääketieteen termit
comment: Ulkoisten tekijöiden (aamuherätys, työaikataulu) ohjaama, tarkalleen vuorokauden pituisia jaksoja käsittävä rytmi.
alternative label: sirkadiaanirytmi
alternative label: sirkadiaaninen rytmi
alternative label: vuorokausirytmi
broader: ulkoiset ominaisuudet
in scheme: conceptscheme
preferred label: diurnal rhythm @en
preferred label: dygnsrytm @sv
scope note: Sanalla on kaksi merkitystä. 1) Ulkoisten tekijöiden (aamuherätys, työaikataulu) ohjaama, tarkalleen vuorokauden pituisia jaksoja käsittävä rytmi. 2) Niiden elintoimintojen sisäsyntyinen rytmi, joiden toistuvan jakson pituus on suunnilleen 24 tuntia

ulkoiset ominaisuudet
type: Concept
narrower: vuorokausirytmi (toimintojen)
preferred label: external properties @en
preferred label: yttre egenskaper @sv