Raseborg Castle
type: Concept
broader: castles
in scheme: conceptscheme
preferred label: Raseborgs slott @sv
preferred label: Raaseporin linna @fi
scope note: Rauniolinna Tammisaaressa. Kaupunginosaa tarkoitettaessa käytä muotoa Tammisaari -- Raasepori

castles
type: Concept
narrower: Raseborg Castle
preferred label: linnat @fi
preferred label: slott @sv