stanols
type: Concept
comment: Stanolit ovat tyydyttyneitä steroleja eli niiden sterolirenkaassa ei ole kaksoissidoksia.
broader: sterols
in scheme: conceptscheme
preferred label: stanolit @fi
preferred label: stanoler @sv

sterols
type: Concept
narrower: stanols
preferred label: steroler @sv
preferred label: sterolit @fi