fordismi
type: Concept
comment: AV: The social institutions of mass production --- collectively referred to as Fordism
broader: aatteet
in scheme: conceptscheme
preferred label: Fordism @en
preferred label: fordism @sv
related: postfordismi

aatteet
type: Concept
narrower: fordismi
preferred label: tankar (idéer) @sv
preferred label: ideas @en

postfordismi
type: Concept
preferred label: post-Fordism @en
preferred label: postfordism @sv
related: fordismi