alistus (ratkaistavaksi)
type: Concept
source: Kielitoimiston sanakirja
comment: toimittaa päätös jkn (tav. ylemmässä asemassa olevan) ratkaistavaksi
alternative label: alistusmenettely
alternative label: alistaminen
alternative label: alistus
broader: menettelyt
in scheme: conceptscheme
preferred label: reference @en
preferred label: underordning @sv

menettelyt
type: Concept
narrower: alistus (ratkaistavaksi)
preferred label: förfaranden @sv
preferred label: procedures @en