Pallas-Ounastunturi nationalpark
type: Concept
part of: Pallas-Yllästunturi nationalpark
broader: nationalparker
in scheme: conceptscheme
preferred label: Pallas-Ounastunturi National Park @en
preferred label: Pallas-Ounastunturin kansallispuisto @fi
related: Pallas-Yllästunturi nationalpark
scope note: Pallas-Ounastunturin kansallispuisto ja Ylläs-Aakenuksen suojelualue yhdistettiin vuonna 2005 Pallas-Yllästunturin kansallispuistoksi

Pallas-Yllästunturi nationalpark
type: Concept
preferred label: Pallas-Yllästunturi National Park @en
preferred label: Pallas-Yllästunturin kansallispuisto @fi
related: Pallas-Ounastunturi nationalpark

nationalparker
type: Concept
narrower: Pallas-Ounastunturi nationalpark
preferred label: national parks @en
preferred label: kansallispuistot @fi