illusionismi (tyylit)
type: Concept
source: Kielitoimiston sanakirja
comment: maalaustaiteessa: pyrkimys silmän harhauttamiseen, pettävään todellisuusvaikutelmaan
alternative label: illusionismi
broader: tyylit (ilmiöt)
in scheme: conceptscheme
preferred label: illusionism (styles) @en
preferred label: illusionism (stilar) @sv

tyylit (ilmiöt)
type: Concept
narrower: illusionismi (tyylit)
preferred label: stilar (fenomen) @sv
preferred label: styles @en