tiet
type: Concept
narrower: Jäämerentie
preferred label: roads @en
preferred label: vägar @sv

Jäämerentie
type: Concept
alternative label: Jäämeren tie
broader: tiet
in scheme: conceptscheme
preferred label: Ishavsvägen @sv
scope note: Maantie Rovaniemi - Ivalo - Virtaniemi, aikaisemmin Petsamon Liinahamariin saakka
scope note: Landsväg mellan Rovaniemi och Petsamo