romanticism
type: Concept
preferred label: romantiken @sv
preferred label: romantiikka @fi
related: Düsseldorf school of painting

Düsseldorf school of painting
type: Concept
broader: artist groups
in scheme: conceptscheme
preferred label: Düsseldorfskolan @sv
preferred label: Düsseldorfin koulukunta @fi
related: romanticism
scope note: Düsseldorfissa Saksassa opiskelleiden ja työskennelleiden maalareiden romanttis-realistinen suuntaus 1820-luvun puolivälistä 1860-luvulle

artist groups
type: Concept
narrower: Düsseldorf school of painting
preferred label: konstnärsgrupper @sv
preferred label: taiteilijaryhmät @fi