teippaus
type: Concept
source: Suomen kielen perussanakirja
comment: 1) kiinnittää, sitoa, sulkea, peittää; 2) urheilu- yms. vammojen hoidossa ja ehkäisyssä: sitoa tiukasti teipin tapaisella siteellä
broader: paikalleen laittava luonti
in scheme: conceptscheme
preferred label: taping @en
preferred label: tejpning @sv

paikalleen laittava luonti
type: Concept
narrower: teippaus
preferred label: creation by placing @en
preferred label: placerande skapande @sv