ammatit
type: Concept
narrower: asessorit (ammatit)
preferred label: occupations @en
preferred label: yrken @sv

asessorit (ammatit)
type: Concept
source: Lähde: Turtia, K. Sivistyssanat
alternative label: asessorit
broader: ammatit
in scheme: conceptscheme
preferred label: asessorer (ämbeten) @sv
preferred label: assistant judges (occupations) @en
scope note: Sanalla on monia merkityksiä. 1) Oikeusoppinut virkamies eri virastoissa. 2) Tuomiokapitulin jäsen. 3) Arvonimi. 4) Historiallisessa merkityksessä hovioikeuden jäsen