sefarder
type: Concept
source: Lähde: Valpola, V. Suuri sivistyssanakirja
alternative label: sefardiska judar
alternative label: sefardit @fi
alternative label: sefardimjuutalaiset @fi
broader: judar
in scheme: conceptscheme
preferred label: Sephardi Jews @en
preferred label: sefardijuutalaiset @fi
scope note: Ättlingar till judar som levde i Sefarad före fördrivningen på 1490-talet.
scope note: Tarkoittaa Etelä- ja Länsi-Eurooppaan asettuneita juutalaisia

judar
type: Concept
narrower: sefarder
preferred label: Jews @en
preferred label: juutalaiset (väestöryhmään liittyvä rooli) @fi