buildings
type: Concept
narrower: Villa Miniato
preferred label: rakennukset @fi
preferred label: byggnader @sv

Villa Miniato
type: Concept
broader: buildings
in scheme: conceptscheme
scope note: Huvila Espoon Soukassa, valmistui 1902, suunnittelu Arkkitehtuuritoimisto Gesellius, Lindgren & Saarinen