sexual abnormalities
type: Concept
preferred label: seksuaaliset poikkeavuudet @fi
preferred label: sexuella avvikelser @sv
related: pedophilia

mental phenomena
type: Concept
narrower: pedophilia
preferred label: mentala fenomen @sv
preferred label: mentaaliset ilmiöt @fi

pedophilia
type: Concept
source: MOT Lääketiede 2.0a
comment: sukupuolinen kohdehäiriö, jolle on ominaista vähintään 16-vuotiaan jatkuva sukupuolinen kiinnostus alle 13-vuotiaisiin lapsiin (ikäeron ollessa vähintään 5 vuotta), siten että kiinnostus johtaa seksuaaliseen käyttäytymiseen tai aiheuttaa kokijalleen huomattavaa kärsimystä
broader: mental phenomena
in scheme: conceptscheme
preferred label: pedofilia @fi
preferred label: pedofili @sv
related: sexual abnormalities