spies
type: Concept
preferred label: spioner @sv
preferred label: vakoilijat @fi
related: reconnaissance parachutists

reconnaissance parachutists
type: Concept
source: Kielitoimiston sanakirja
comment: toisen maailmansodan aikaan vihollisen selustaan vakoilu- t. sabotaasitarkoituksessa lähetetyistä neuvostoliittolaisista laskuvarjomiehistä
broader: role related to action
in scheme: conceptscheme
preferred label: desantit @fi
preferred label: desanter @sv
related: spies

role related to action
type: Concept
narrower: reconnaissance parachutists
preferred label: sysselsättningsrelaterad roll @sv
preferred label: toimintaan liittyvä rooli @fi