buildings
type: Concept
narrower: Grönvqist house
preferred label: rakennukset @fi
preferred label: byggnader @sv

Grönvqist house
type: Concept
broader: buildings
in scheme: conceptscheme
preferred label: Grönqvistska huset @sv
preferred label: Grönqvistin talo @fi
scope note: Kulttuurihistoriallinen rakennus Helsingin Pohjoisesplanadilla