rengöring
type: Concept
narrower: biologisk rening
preferred label: cleaning @en
preferred label: puhdistus @fi

biologisk rening
type: Concept
alternative label: bioremediaatio @fi
alternative label: biorening
alternative label: biopuhdistus @fi
alternative label: biologinen vedenpuhdistus @fi
preferred label: bioremediation
alternative label: biologisk vattenrening
broader: rengöring
in scheme: conceptscheme
preferred label: biologinen puhdistus @fi
scope note: Tarkoittaa mikrobien hyväksikäyttöä jätteiden käsittelyssä