managerialism
type: Concept
source: Lähde: Ojala, I., Managerialismi ja oppilaitosjohtaminen
broader: ideologier
in scheme: conceptscheme
preferred label: managerialismi @fi
scope note: Managerialismilla tarkoitetaan yksilöjohtamisen edellytysten lisäämistä ja yksilöjohtamisen alan laajentamista korostavaa ideologiaa, joka heijastuu yksilöiden arvoihin, asenteisiin ja käyttäytymiseen, poliittis-hallinnollisten ohjelmien tavoitteisiin, organisaatioiden rakennepiireteisiin ja toimintakäytäntöihin

ideologier
type: Concept
narrower: managerialism
preferred label: ideologies @en
preferred label: ideologiat @fi