mesothelioma
type: Concept
source: Terveyskirjasto
comment: keuhkopussista tai vatsakalvosta peräisin oleva harvinainen kasvain
broader: tumours
in scheme: conceptscheme
preferred label: mesoteliooma @fi
preferred label: mesoteliom @sv

tumours
type: Concept
narrower: mesothelioma
preferred label: tumörer @sv
preferred label: kasvaimet @fi