Kiiskilä manor
type: Concept
broader: manors
in scheme: conceptscheme
preferred label: Kiiskilä @sv
scope note: Kartano Viipurinlahden rannalla, noin kymmenen kilometriä Viipurista lounaaseen

manors
type: Concept
narrower: Kiiskilä manor
preferred label: herrgårdar @sv
preferred label: kartanot @fi