försäljning
type: Concept
narrower: utskänkning
preferred label: sales @en
preferred label: myynti @fi

utskänkning
type: Concept
source: Kielitoimiston sanakirja
comment: myydä alkoholijuomia myyntipaikalla nautittavaksi
broader: försäljning
in scheme: conceptscheme
preferred label: anniskelu @fi
preferred label: serving of alcohol @en