biologiska fenomen
type: Concept
narrower: generationsväxling
preferred label: biological phenomena @en
preferred label: biologiset ilmiöt @fi

generationsväxling
type: Concept
source: Biologian sanakirja
comment: useimmilla kasveilla ja alkeellisilla eläimillä esiintyvä elinkieritomalli, jossa suvullisesti ja suvuttomasati lisääntyvät sukupolvet vuorottelevat
alternative label: generationsväxling -- biologi
broader: biologiska fenomen
in scheme: conceptscheme
preferred label: sukupolvenvuorottelu @fi
preferred label: alternation of generations @en
related: förökning

förökning
type: Concept
preferred label: reproduction, biology @en
preferred label: lisääntyminen (biologiset ilmiöt) @fi
related: generationsväxling