Mesa Verde (nationalpark)
type: Concept
broader: nationalparker
in scheme: conceptscheme
preferred label: Mesa Verde National Park @en
preferred label: Mesa Verde @fi
scope note: Esihistoriallinen vuoristoasutus Coloradossa Yhdysvalloissa. Kansallispuisto vuodesta 1906 lähtien

nationalparker
type: Concept
narrower: Mesa Verde (nationalpark)
preferred label: national parks @en
preferred label: kansallispuistot @fi