återvinning (juridik)
type: Concept
source: Kielitoimiston sanakirja
comment: määräolosuhteiden ennalleen saattamisesta vars. konkurssin t. ulosoton yhteydessä; eräs muutoksenhakukeino
alternative label: återvinning -- juridik
broader: förvärv
in scheme: conceptscheme
preferred label: takaisinsaanti @fi
preferred label: recovery, legal proceedings @en

förvärv
type: Concept
narrower: återvinning (juridik)
preferred label: reception (transfer of ownership) @en
preferred label: saanti (omistuksen siirtäminen) @fi