annual festivals
type: Concept
narrower: Halloween
preferred label: årets fester @sv
preferred label: vuotuisjuhlat @fi

all saints' day
type: Concept
preferred label: alla helgons dag @sv
preferred label: pyhäinpäivä @fi
related: Halloween

Halloween
type: Concept
broader: annual festivals
in scheme: conceptscheme
preferred label: halloween @sv
related: all saints' day
scope note: Varsinkin anglosaksisissa maissa pyhäinpäivän aattona vietettävä juhlapäivä