muromat
type: Concept
comment: nykyisen Vladimirin alueella asuneet suomalais-ugrilaista muroman kieltä puhuneet muromat sulautuivat slaaveihin jo keskiajalle tultaessa
alternative label: muromalaiset
broader: suomalais-ugrilaiset
in scheme: conceptscheme
preferred label: muromer @sv
preferred label: Muromian people @en

suomalais-ugrilaiset
type: Concept
narrower: muromat
preferred label: Finno-Ugrians @en
preferred label: finsk-ugriska folk @sv