publikationer
type: Concept
narrower: textutgåvor
preferred label: julkaisut @fi
preferred label: publications @en

textutgåvor
type: Concept
source: Lähde: Suomen kielen perussanakirja
broader: publikationer
in scheme: conceptscheme
preferred label: tekstijulkaisut @fi
preferred label: text publications @en
scope note: Tarkoittaa historiallisesti ja kielitieteellisesti arvokkaita tekstejä sisältäviä julkaisuja