kuppaus
type: Concept
source: Kielitoimiston sanakirja
comment: kansanomaisena parannusmenetelmänä: laskea jksta verta tekemällä ihoon pieniä haavoja ja kiinnittämällä niiden kohdalle imusarvet t. -lasit
broader: kansanlääkintä
in scheme: conceptscheme
preferred label: cupping @en
preferred label: koppning @sv

kansanlääkintä
type: Concept
narrower: kuppaus
preferred label: folk medicine @en
preferred label: folkmedicin @sv