vastineet
type: Concept
source: Suomen kielen perussanakirja
comment: 1) jotakin vastaava esine, asia tms.; samaan käyttöön tai tarkoitukseen soveltuva esine, asia tms. kuin jokin toinen; 2) (vars. kirjallinen) vastaus arvosteluun, moitteeseen tms., (oik.) vastaajan oikeudenkäynnissä antama selvitys, joka sisältää hänen vaatimuksensa; 3) korvaus, hyvitys, vastike
broader: käyttöön liittyvä rooli
in scheme: conceptscheme
preferred label: equivalents @en
preferred label: motsvarigheter @sv

käyttöön liittyvä rooli
type: Concept
narrower: vastineet
preferred label: roll i förhållande till användning @sv
preferred label: role related to use @en