chilli
type: Concept
comment: Chili on nimitys niille paprikoille (Capsicum), joiden kapsaisiinipitoisuus on niin suuri, että niitä voidaan hyödyntää mausteina eri ruoissa.
broader: spices
in scheme: conceptscheme
preferred label: chili @sv

spices
type: Concept
narrower: chilli
preferred label: kryddor @sv
preferred label: mausteet @fi