kantaminen
type: Concept
source: Suomen kielen perussanakirja
comment: 1) kuljettaa jotakin (suhteellisen painavaa) kädessään tai käsissään, olallaan, selässään tms.; 2) vedestä, tuulesta yms.: kuljettaa, tuoda, viedä; 3) kestää jokin paino, kannattaa; 4) kestää, kärsiä, sietää; 5) kerätä, periä (veroja tms.); 6) eläimistä: olla tiineenä, tiinehtiä; 7) kasveista, maasta: tuottaa, antaa satoa; 8) lentää, sinkoutua johonkin asti; yltää, ulottua
broader: liikuttaminen
in scheme: conceptscheme
preferred label: carrying @en
preferred label: bärande @sv

liikuttaminen
type: Concept
narrower: kantaminen
preferred label: causing to move @en
preferred label: rörelseframkallande @sv