kulturer (typer)
type: Concept
narrower: indiankulturer
preferred label: kulttuurit (kulttuurimuodot) @fi
preferred label: cultures @en

indiankulturer
type: Concept
broader: kulturer (typer)
in scheme: conceptscheme
preferred label: intiaanikulttuurit @fi
preferred label: american indian cultures @en
scope note: Eri intiaanikulttuurit indeksoidaan esim. inkat -- kulttuuri ja intiaanikulttuurit -- inkat
scope note: Olika indiankulturer indexeras t.ex. indiankulturer : inkaindianer