Brinkhall
type: Concept
alternative label: Brinkkala
alternative label: Prinkkala
alternative label: Brinkala
broader: kartanot
in scheme: conceptscheme
preferred label: Brinkhall manor @en
scope note: Kartano Turussa, aiemmin Kakskerran kunnassa

kartanot
type: Concept
narrower: Brinkhall
preferred label: herrgårdar @sv
preferred label: manors @en