metoder
type: Concept
narrower: mätmetoder
preferred label: menetelmät @fi
preferred label: methods @en

mätmetoder
type: Concept
alternative label: mätningsmetoder
alternative label: mittaamismenetelmät @fi
broader: metoder
in scheme: conceptscheme
narrower: DAP-mätare
preferred label: mittausmenetelmät @fi
preferred label: measuring methods @en
scope note: Mittausmenetelmien nimiä voi käyttää asiasanoina
scope note: Namnen på olika mätmetoder kan användas som ämnesord vid indexering

DAP-mätare
type: Concept
broader: mätmetoder
preferred label: DAP measurement @en
preferred label: DAP-mittaus @fi