yleistäminen
type: Concept
source: Suomen kielen perussanakirja
comment: 1) laajentaa jokin havainto, päätelmä tms. koskemaan muita tai kaikkia samanlaisia tapauksia; tehdä yksittäistapausten perusteella yleisiä päätelmiä; antaa jollekin yleinen pätevyys; 2) tehdä yleise(mmä)ksi
broader: kognitio
in scheme: conceptscheme
preferred label: generalisering @sv
preferred label: generalisation @en

kognitio
type: Concept
narrower: yleistäminen
preferred label: kognition @sv
preferred label: cognition @en