vapaaehtoiset
type: Concept
source: Suomen kielen perussanakirja
comment: 1) ihmisestä: omasta tahdostaan, pakottamatta jotakin tekevä; korvauksetta työskentelevä; 2) omasta anomuksestaan ennen kutsuntaikää asevelvollisuuttaan suorittamaan hyväksytty
broader: toimintaan liittyvä rooli
in scheme: conceptscheme
preferred label: volunteers @en
preferred label: frivilliga @sv

toimintaan liittyvä rooli
type: Concept
narrower: vapaaehtoiset
preferred label: role related to action @en
preferred label: sysselsättningsrelaterad roll @sv