agentit
type: Concept
source: Suomen kielen perussanakirja
comment: 1) asiamies, edustaja; 2) salaisen palvelun asiamies, vakooja; 3) (kiel.) eräs teon suorittajan ilmaiseva lauseenjäsen
broader: toimintaan liittyvä rooli
in scheme: conceptscheme
preferred label: agenter @sv
preferred label: agents @en
related: kaksoisagentit

kaksoisagentit
type: Concept
preferred label: double agents @en
preferred label: dubbelagenter @sv
related: agentit

toimintaan liittyvä rooli
type: Concept
narrower: agentit
preferred label: role related to action @en
preferred label: sysselsättningsrelaterad roll @sv